{"text_format":"1","workbook":"xlsx","n_sheets":5,"sheets":["1. Control Sheet","2. Instruction","3. Data Protection Self-Assessm","4. Summary report","5. Answer reference sheet"],"not_rendered":{"charts":0,"images":2,"macros":1,"external_links":0,"defined_names":0,"comments":0,"pivot_tables":0},"unopened":[],"bounds":{"document_bytes":16777216,"sheet_cells":100000,"rows_first":2000,"rows_last":500,"rows_between":2000,"halvings":0,"cell_chars":16384,"cell_head_chars":4096},"cells_cut":0,"cells_raw":0,"read":"whole","date_system":"1900"}

{"sheet":"1. Control Sheet","index":0,"n_rows":19,"n_cols":4,"rows_kept":19,"cut":false,"hidden":true,"merged":[[15,1,15,2],[15,3,15,4],[18,1,18,4]]}
[]
[null,"Document Control "]
[null,"Document Title","Data Protection Self-Assessment"]
[null,"Document Type ","Assessment sheet"]
[null,"Version",2]
[null,"Document Reference","PDPPL-02050701E"]
[null,"Document Owner ","CGAA"]
[null,"Document Classification","External"]
[]
[null,"Document History "]
[null,"Version Number ","Description ","Date"]
[null,1,"Internal V1.0 document","August 2020"]
[null,2,"Aligned to NCSA Branding","2022-09-01"]
[null,"Related Documents "]
[null,"Document Reference ",null,"Document Title "]
{"$rows_left_out":5}
{"sheet":"2. Instruction","index":1,"n_rows":17,"n_cols":3,"rows_kept":17,"cut":false,"hidden":false,"merged":[[14,2,14,4],[15,1,15,4],[16,1,16,4],[3,1,3,4],[4,1,4,4],[5,1,5,4],[6,1,6,4],[7,1,7,4],[10,1,10,4],[8,2,8,4],[9,2,9,4],[11,1,11,4],[12,2,12,4],[13,2,13,4]]}
[]
[]
[]
[null,"Introduction"]
[null,"This Self-Assessment Checklist will be most helpful for small to medium sized organisations across all sectors. It acts as an orientation tool to enable organisations to identify key areas of focus against the data privacy concepts addressed in the PDPPL, orient their reading and knowledge development towards key relevant guidelines and develop the maturity of their data privacy programme to enhance their reputation, customer confidence and data privacy risk management."]
[null,"Instructions"]
[null,"1. To conduct a Self-Assessment of your organisation's PDPPL compliance, click the \"Begin Self-Assessment\" button above. You should only check one answer per question in the yellow column within the Self-Assessment. \nShould you wish to restart the Self-Assessment, simply click the \"Restart Self-Assessment\" button which will clear your answers. Prior to conducting the assessment, ensure that all answers in column E are cleared, then proceed with answering the questions by selecting the answer most relevant to your organisation.\n2. Once the Self-Assessment Checklist has been completed, click on the \"Produce Report\" button to obtain a high-level summary of initial considerations that should be made based on the answers provided in the Checklist when planning actions to further improve your organisation's data privacy compliance maturity. Please note that completion of the recommended considerations within the report produced will not guarantee compliance on the part of the organisation. Organisations are accountable for their own compliance and must refer to the key referenced guidelines for each question to obtain information on each subject alongside the PDPPL, all guidelines issued by the NCSA, and any related ministerial decisions."]
[null,"Column Colour Key"]
[null,null,"Column titles that are referenced with this colour consist of editable fields."]
[null,null,"Column titles that are referenced with this colour are restricted and are uneditable."]
[null,"Understanding your results"]
[null,"Upon completing the assessment and clicking \"Produce Report,\" a report will be provided with an overview of your results based on your answers. It will include one of the following ratings:"]
[null,"Green","Based on your answers, your organisation has a mature Data Privacy programme though some actions may still be required to meet a higher level of compliance. \nPlease note you should still seek to carry out a full programme of compliance against the PDPPL, as this assessment is not a substitute for reading, understanding, and acting upon the requirements of the PDPPL, guidelines issued by the NCSA, and any related ministerial decisions. "]
[null,"Amber","Based on your answers, your organisation has demonstrated it has some requisite elements of a Data Privacy programme however more activities need to be undertaken, and measures implemented, to demonstrate a higher level of compliance."]
[null,"Red","Based on your answers, your organisation does not currently have a comprehensive Data Privacy programme and will need to plan and conduct recommended activities to avoid disruption to the business, significant regulatory fines, legal claims and / or complaint from individuals."]
{"$rows_left_out":3}
{"sheet":"3. Data Protection Self-Assessm","index":2,"n_rows":64,"n_cols":9,"rows_kept":64,"cut":false,"hidden":false,"merged":[[31,4,33,4],[25,1,27,1],[28,1,30,1],[28,2,30,2],[28,3,30,3],[28,4,30,4],[31,1,33,1],[25,4,27,4],[25,2,27,2],[25,3,27,3],[31,2,33,2],[31,3,33,3],[34,4,36,4],[37,1,39,1],[37,2,39,2],[37,4,39,4],[43,1,45,1],[43,2,45,2],[43,3,45,3],[40,1,42,1],[40,2,42,2],[40,3,42,3],[40,4,42,4],[43,4,45,4],[19,4,21,4],[22,4,24,4],[7,1,9,1],[7,2,9,2],[7,3,9,3],[10,1,12,1],[10,2,12,2],[10,3,12,3],[7,4,9,4],[10,4,12,4],[13,4,15,4],[13,1,15,1],[16,1,18,1],[16,2,18,2],[16,3,18,3],[16,4,18,4],[3,5,3,8],[5,1,6,1],[5,2,6,2],[5,3,6,3],[5,4,6,4],[13,2,15,2],[13,3,15,3],[19,1,21,1],[19,2,21,2],[19,3,21,3],[22,1,24,1],[22,2,24,2],[22,3,24,3],[37,3,39,3],[34,1,36,1],[34,2,36,2],[34,3,36,3],[49,4,51,4],[49,1,51,1],[49,2,51,2],[49,3,51,3],[46,1,48,1],[46,2,48,2],[46,3,48,3],[46,4,48,4],[52,4,54,4],[61,1,63,1],[61,2,63,2],[61,3,63,3],[61,4,63,4],[55,1,57,1],[55,2,57,2],[55,3,57,3],[55,4,57,4],[58,1,60,1],[58,2,60,2],[58,3,60,3],[58,4,60,4],[52,1,54,1],[52,2,54,2],[52,3,54,3]]}
[]
[]
[null,null,null,null,null,null,null,null,false]
[null,"Ref.","Key NCSA guidance","Category","Question","Answer"]
[null,null,null,null,null,null,"Only check 1"]
[null,{"$f":"'5. Answer reference sheet'!B5","v":"1\n(Intro)"},{"$f":"'5. Answer reference sheet'!C5","v":"N/A"},{"$f":"'5. Answer reference sheet'!D5","v":"Applicability of the PDPPL"},{"$f":"'5. Answer reference sheet'!E5","v":"Does your organisation process personal data electronically; collect, receive or mine personal data in anticipation of processing it electronically or process personal data through a combination of electronic and traditional processing techniques?\n\n*If you do not process any personal data, you will not need to complete the rest of this assessment or take action to comply with the PDPPL."},{"$f":"'5. Answer reference sheet'!H5","v":"A"},true,{"$f":"F6","v":"A"},{"$f":"'5. Answer reference sheet'!I5","v":"No"}]
[null,null,null,null,null,{"$f":"'5. Answer reference sheet'!H6","v":"B"},false,{"$f":"F7","v":"B"},{"$f":"'5. Answer reference sheet'!I6","v":"Yes"}]
[null,{"$f":"'5. Answer reference sheet'!B7","v":2},{"$f":"'5. Answer reference sheet'!C7","v":"- Principles of Data Privacy Guidelines for Regulated Entities"},{"$f":"'5. Answer reference sheet'!D7","v":"Principles of Data Privacy"},{"$f":"'5. Answer reference sheet'!E7","v":"Does your organisation conduct regular audits to understand the processing of personal data that it undertakes?\n\n*These audits will help you understand how personal data flows across the organisation and how it is used."},{"$f":"'5. Answer reference sheet'!H7","v":"A"},false,{"$f":"F8","v":"A"},{"$f":"'5. Answer reference sheet'!I7","v":"No - Not yet completed"}]
[null,null,null,null,null,{"$f":"'5. Answer reference sheet'!H8","v":"B"},false,{"$f":"F9","v":"B"},{"$f":"'5. Answer reference sheet'!I8","v":"Yes - Successfully completed"}]
[null,null,null,null,null,{"$f":"'5. Answer reference sheet'!H9","v":"C"},false,{"$f":"F10","v":"C"},{"$f":"'5. Answer reference sheet'!I9","v":"No - Not Applicable"}]
[null,{"$f":"'5. Answer reference sheet'!B10","v":3},{"$f":"'5. Answer reference sheet'!C10","v":"- Register of Processing Activities (RoPA) Guidelines for Regulated Entities"},{"$f":"'5. Answer reference sheet'!D10","v":"Principles of Data Privacy"},{"$f":"'5. Answer reference sheet'!E10","v":"Does your organisation document what personal data of individuals (e.g. customers and/or employees) it processes in a RoPA?"},{"$f":"'5. Answer reference sheet'!H10","v":"A"},false,{"$f":"F11","v":"A"},{"$f":"'5. Answer reference sheet'!I10","v":"No - Not yet completed"}]
[null,null,null,null,null,{"$f":"'5. Answer reference sheet'!H11","v":"B"},false,"B",{"$f":"'5. Answer reference sheet'!I11","v":"Yes - Successfully completed"}]
[null,null,null,null,null,{"$f":"'5. Answer reference sheet'!H12","v":"C"},false,"C",{"$f":"'5. Answer reference sheet'!I12","v":"No - Not Applicable"}]
[null,{"$f":"'5. Answer reference sheet'!B13","v":4},{"$f":"'5. Answer reference sheet'!C13","v":"- Permitted Reasons Guidelines for Regulated Entities"},{"$f":"'5. Answer reference sheet'!D13","v":"Permitted Reasons "},{"$f":"'5. Answer reference sheet'!E13","v":"Does your organisation have measures in place to identify and document the permitted reason for processing personal data?\n\n*Under the PDPPL there are four permitted reasons for processing, these are:\n- Explicit Consent: of the individual to the processing of personal data. \n- Contractual: processing is needed in order to enter into a contract.\n- Legal Obligation: for which the organisation is obliged to process data for.\n- Legitimate Interest: of the organisation or the third parties engaged."},{"$f":"'5. Answer reference sheet'!H13","v":"A"},false,"A",{"$f":"'5. Answer reference sheet'!I13","v":"No - Not yet completed"}]
[null,null,null,null,null,{"$f":"'5. Answer reference sheet'!H14","v":"B"},false,"B",{"$f":"'5. Answer reference sheet'!I14","v":"Yes - Successfully completed"}]
{"$rows_left_out":50}
{"sheet":"4. Summary report","index":3,"n_rows":30,"n_cols":11,"rows_kept":30,"cut":false,"hidden":false,"merged":[[20,7,20,8],[21,7,21,8],[22,7,22,8],[23,7,23,8],[24,7,24,8],[18,7,18,8],[19,7,19,8],[1,6,1,10],[3,10,5,10],[8,6,8,8],[9,6,9,8],[10,7,10,8],[11,7,11,8],[12,7,12,8],[13,7,13,8],[14,7,14,8],[15,7,15,8],[16,7,16,8],[17,7,17,8],[25,7,25,8],[26,7,26,8],[27,7,27,8],[28,7,28,8],[29,7,29,8]]}
[]
[null,null,null,null,null,null,"Report Dashboard"]
[null,null,null,null,null,null,"Ref.","Definition","Number of Response",null,"Overall Rating"]
[null,null,null,null,null,null,"A","Not yet completed",{"$f":"COUNTIF($G$11:$G$30,\"A\")","v":1},{"$f":"I4/K7","v":0.05},{"$f":"_xlfn.IFS(J5>0.67,\"Green\", 0.33>J5, \"Red\", 0.67>J5,\"Amber\")","v":"Red"}]
[null,null,null,null,null,null,"B","Successfully completed",{"$f":"COUNTIF($G$11:$G$30,\"B\")","v":0},{"$f":"I5/K7","v":0}]
[null,null,null,null,null,null,"C","N/A",{"$f":"COUNTIF($G$11:$G$30,\"C\")","v":0}]
[null,null,null,null,null,null,null,null,null,{"$f":"SUM(J4:J5)","v":0.05},{"$f":"20-I6","v":20}]
[]
[null,"Ref.","Relevant NCSA guidance","Category","Question","CONCAT","Your Answer",null,null,null,"Initial Considerations"]
[]
[null,{"$f":"'3. Data Protection Self-Assessm'!B6","v":"1\n(Intro)"},{"$f":"'3. Data Protection Self-Assessm'!C6","v":"N/A"},{"$f":"'3. Data Protection Self-Assessm'!D6","v":"Applicability of the PDPPL"},{"$f":"'3. Data Protection Self-Assessm'!E6","v":"Does your organisation process personal data electronically; collect, receive or mine personal data in anticipation of processing it electronically or process personal data through a combination of electronic and traditional processing techniques?\n\n*If you do not process any personal data, you will not need to complete the rest of this assessment or take action to comply with the PDPPL."},{"$f":"CONCATENATE(B11,G11)","v":"1\n(Intro)A"},{"$f":"VLOOKUP(TRUE,'3. Data Protection Self-Assessm'!G6:H7,2,FALSE)","v":"A"},{"$f":"VLOOKUP(G11,$G$4:$H$6,2,FALSE)","v":"Not yet completed"},null,null,{"$f":"VLOOKUP(F11,'5. Answer reference sheet'!G5:J6,4,TRUE)","v":"o Organisation's processing is not captured within the scope of the PDPPL and does not need to take action to comply."}]
[null,{"$f":"'3. Data Protection Self-Assessm'!B8","v":2},{"$f":"'3. Data Protection Self-Assessm'!C8","v":"- Principles of Data Privacy Guidelines for Regulated Entities"},{"$f":"'3. Data Protection Self-Assessm'!D8","v":"Principles of Data Privacy"},{"$f":"'3. Data Protection Self-Assessm'!E8","v":"Does your organisation conduct regular audits to understand the processing of personal data that it undertakes?\n\n*These audits will help you understand how personal data flows across the organisation and how it is used."},{"$error":"#N/A"},{"$f":"VLOOKUP(TRUE,'3. Data Protection Self-Assessm'!G8:H10,2,FALSE)","v":{"$error":"#N/A"}},{"$error":"#N/A"},null,null,{"$f":"VLOOKUP(F12,'5. Answer reference sheet'!G7:J9,4,TRUE)","v":{"$error":"#N/A"}}]
[null,{"$f":"'3. Data Protection Self-Assessm'!B11","v":3},{"$f":"'3. Data Protection Self-Assessm'!C11","v":"- Register of Processing Activities (RoPA) Guidelines for Regulated Entities"},{"$f":"'3. Data Protection Self-Assessm'!D11","v":"Principles of Data Privacy"},{"$f":"'3. Data Protection Self-Assessm'!E11","v":"Does your organisation document what personal data of individuals (e.g. customers and/or employees) it processes in a RoPA?"},{"$error":"#N/A"},{"$f":"VLOOKUP(TRUE,'3. Data Protection Self-Assessm'!G11:H13,2,FALSE)","v":{"$error":"#N/A"}},{"$error":"#N/A"},null,null,{"$f":"VLOOKUP(F13,'5. Answer reference sheet'!G10:J12,4,TRUE)","v":{"$error":"#N/A"}}]
[null,{"$f":"'3. Data Protection Self-Assessm'!B14","v":4},{"$f":"'3. Data Protection Self-Assessm'!C14","v":"- Permitted Reasons Guidelines for Regulated Entities"},{"$f":"'3. Data Protection Self-Assessm'!D14","v":"Permitted Reasons "},{"$f":"'3. Data Protection Self-Assessm'!E14","v":"Does your organisation have measures in place to identify and document the permitted reason for processing personal data?\n\n*Under the PDPPL there are four permitted reasons for processing, these are:\n- Explicit Consent: of the individual to the processing of personal data. \n- Contractual: processing is needed in order to enter into a contract.\n- Legal Obligation: for which the organisation is obliged to process data for.\n- Legitimate Interest: of the organisation or the third parties engaged."},{"$error":"#N/A"},{"$f":"VLOOKUP(TRUE,'3. Data Protection Self-Assessm'!G14:H16,2,FALSE)","v":{"$error":"#N/A"}},{"$error":"#N/A"},null,null,{"$f":"VLOOKUP(F14,'5. Answer reference sheet'!G13:J15,4,TRUE)","v":{"$error":"#N/A"}}]
[null,{"$f":"'3. Data Protection Self-Assessm'!B17","v":5},{"$f":"'3. Data Protection Self-Assessm'!C17","v":"- Competent Authority Exemptions Guidelines for Regulated Entities\n\n- Controller Exemptions Guidelines for Regulated Entities"},{"$f":"'3. Data Protection Self-Assessm'!D17","v":"Exemptions"},{"$f":"'3. Data Protection Self-Assessm'!E17","v":"Does your organisation have measures in place to identify and document any exemptions under articles 18 and/or 19?"},{"$error":"#N/A"},{"$f":"VLOOKUP(TRUE,'3. Data Protection Self-Assessm'!G17:H19,2,FALSE)","v":{"$error":"#N/A"}},{"$error":"#N/A"},null,null,{"$f":"VLOOKUP(F15,'5. Answer reference sheet'!G16:J18,4,TRUE)","v":{"$error":"#N/A"}}]
{"$rows_left_out":16}
{"sheet":"5. Answer reference sheet","index":4,"n_rows":63,"n_cols":10,"rows_kept":63,"cut":false,"hidden":true,"merged":[[36,4,38,4],[30,1,32,1],[33,1,35,1],[33,2,35,2],[33,3,35,3],[33,4,35,4],[36,1,38,1],[30,4,32,4],[30,2,32,2],[30,3,32,3],[36,2,38,2],[36,3,38,3],[39,1,41,1],[39,2,41,2],[39,3,41,3],[39,4,41,4],[42,1,44,1],[42,2,44,2],[42,3,44,3],[42,4,44,4],[45,1,47,1],[45,2,47,2],[45,3,47,3],[45,4,47,4],[51,1,53,1],[51,2,53,2],[51,3,53,3],[48,4,50,4],[51,4,53,4],[48,1,50,1],[48,2,50,2],[48,3,50,3],[2,7,2,8],[6,1,8,1],[6,2,8,2],[6,3,8,3],[6,4,8,4],[4,1,5,1],[4,2,5,2],[4,3,5,3],[4,4,5,4],[3,7,3,8],[24,4,26,4],[27,4,29,4],[9,1,11,1],[9,2,11,2],[9,3,11,3],[15,1,17,1],[15,2,17,2],[15,3,17,3],[12,1,14,1],[12,2,14,2],[12,3,14,3],[9,4,11,4],[15,4,17,4],[18,4,20,4],[12,4,14,4],[18,1,20,1],[21,1,23,1],[21,2,23,2],[21,3,23,3],[21,4,23,4],[18,2,20,2],[18,3,20,3],[24,1,26,1],[24,2,26,2],[24,3,26,3],[27,1,29,1],[27,2,29,2],[27,3,29,3],[60,1,62,1],[60,2,62,2],[60,3,62,3],[60,4,62,4],[54,1,56,1],[54,2,56,2],[54,3,56,3],[54,4,56,4],[57,1,59,1],[57,2,59,2],[57,3,59,3],[57,4,59,4]]}
[]
[]
[null,"Ref.","Key NCSA Guidance","Category","Question","Hidden Ref.","CONCAT","Your Answer",null,"Initial Considerations"]
[]
[null,"1\n(Intro)","N/A","Applicability of the PDPPL","Does your organisation process personal data electronically; collect, receive or mine personal data in anticipation of processing it electronically or process personal data through a combination of electronic and traditional processing techniques?\n\n*If you do not process any personal data, you will not need to complete the rest of this assessment or take action to comply with the PDPPL.",{"$f":"B5","v":"1\n(Intro)"},{"$f":"CONCATENATE(F5,H5)","v":"1\n(Intro)A"},"A","No","o Organisation's processing is not captured within the scope of the PDPPL and does not need to take action to comply."]
[null,null,null,null,null,{"$f":"B5","v":"1\n(Intro)"},"1\n(Intro)B","B","Yes","o Organisation's processing is captured within the scope of the PDPPL and must take action to comply."]
[null,2,"- Principles of Data Privacy Guidelines for Regulated Entities","Principles of Data Privacy","Does your organisation conduct regular audits to understand the processing of personal data that it undertakes?\n\n*These audits will help you understand how personal data flows across the organisation and how it is used.",{"$f":"B7","v":2},{"$f":"CONCATENATE(F7,H7)","v":"2A"},"A","No - Not yet completed","o Plan an audit schedule across your orgnaisation to document and understand how personal information flows throughout your organisation.\no Document and plan remediation of any risks identified as part of the audit."]
[null,null,null,null,null,{"$f":"B7","v":2},"2B","B","Yes - Successfully completed","o Continue conducting periodic audits. These audits should take into consideration different aspects of the data privacy programme including all relevant stakeholders.\no Ensure this is conducted by a person with extensive knowledge of your organisation."]
[null,null,null,null,null,{"$f":"B7","v":2},"2C","C","No - Not Applicable","o Document reasoning as to why this is Not Applicable. If unsure about applicability, please visit the CGAA website and review relevant published guidelines."]
[null,3,"- Register of Processing Activities (RoPA) Guidelines for Regulated Entities","Principles of Data Privacy","Does your organisation document what personal data of individuals (e.g. customers and/or employees) it processes in a RoPA?",{"$f":"B10","v":3},"3A","A","No - Not yet completed","o Establish a RoPA register that maintains records of processing activities in accordance with the NCSA published guidelines."]
[null,null,null,null,null,{"$f":"B10","v":3},"3B","B","Yes - Successfully completed","o  Review the RoPA in accordance with the NCSA-published guidelines to ensure that the existing RoPA is collecting all information required.\no Monitor the RoPA to ensure that information documented within is relevant and up-to-date and keep under review."]
[null,null,null,null,null,{"$f":"B10","v":3},"3C","C","No - Not Applicable","o Document reasoning as to why this is Not Applicable. If unsure about applicability, please visit the CGAA website and review relevant published guidelines."]
[null,4,"- Permitted Reasons Guidelines for Regulated Entities","Permitted Reasons ","Does your organisation have measures in place to identify and document the permitted reason for processing personal data?\n\n*Under the PDPPL there are four permitted reasons for processing, these are:\n- Explicit Consent: of the individual to the processing of personal data. \n- Contractual: processing is needed in order to enter into a contract.\n- Legal Obligation: for which the organisation is obliged to process data for.\n- Legitimate Interest: of the organisation or the third parties engaged.",{"$f":"B13","v":4},{"$f":"CONCATENATE(F13,H13)","v":"4A"},"A","No - Not yet completed","o Establish measures to identify and document the permitted reasons for processing prior to processing personal data across the organisation."]
[null,null,null,null,null,{"$f":"B13","v":4},"4B","B","Yes - Successfully completed","o Ensure that the documented permitted reasons for processing identified are accurate. \nN.B. No single reason is better or more important than the others. Depending on the purpose for processing and the relationship with the individual you will be able to identify the most appropriate permitted reason for processing personal data."]
[null,null,null,null,null,{"$f":"B13","v":4},"4C","C","No - Not Applicable","o Document exemptions from identifying a permitted reason for processing personal data were relevant in accordance with relevant NCSA published guidelines.\nN.B. Exemptions from Article 4 are available to Controllers under Article 18 in certain circumstances."]
{"$rows_left_out":48}