{"text_format":"1","workbook":"xlsx","n_sheets":5,"sheets":["١ - إدارة الوثيقة","٢ - التعليمات","٣ - التقييم الذاتي","٤ - التقرير","٥ - قائمة الأجوبة"],"not_rendered":{"charts":0,"images":3,"macros":1,"external_links":0,"defined_names":0,"comments":0,"pivot_tables":0},"unopened":[],"bounds":{"document_bytes":16777216,"sheet_cells":100000,"rows_first":2000,"rows_last":500,"rows_between":2000,"halvings":0,"cell_chars":16384,"cell_head_chars":4096},"cells_cut":0,"cells_raw":0,"read":"whole","date_system":"1900"}

{"sheet":"١ - إدارة الوثيقة","index":0,"n_rows":21,"n_cols":4,"rows_kept":21,"cut":false,"hidden":false,"merged":[[20,1,20,4],[19,1,19,2],[19,3,19,4],[15,1,15,2],[15,3,15,4],[16,1,16,2],[16,3,16,4]]}
[]
[null,"إدارة الوثيقة"]
[null,"عنوان الوثيقة","التقييم الذاتي لحماية خصوصية البيانات"]
[null,"نوع الوثيقة","وثيقة تقييم"]
[null,"الاصدار",2]
[null,"الرقم المرجعي للوثيقة","PDPPL-02050701A"]
[null,"مالك الوثيقة","شؤون الحوكمة والضمان السيبراني الوطني"]
[null,"تصنيف الوثيقة","خارجي"]
[]
[null,"تحديثات الوثيقة"]
[null,"رقم الاصدار","الوصف ","التاريخ"]
[null,1,"الوثيقة المنشورة ذات الاصدار ١.٠","أغسطس ٢٠٢٠"]
[null,2,"الوثيقة المنشورة ذات الاصدار ٢.٠","سبتمبر ٢٠٢٢"]
[]
[null,"الوثائق ذات الصلة"]
{"$rows_left_out":7}
{"sheet":"٢ - التعليمات","index":1,"n_rows":17,"n_cols":3,"rows_kept":17,"cut":false,"hidden":false,"merged":[[14,2,14,4],[15,1,15,4],[16,1,16,4],[3,1,3,4],[4,1,4,4],[5,1,5,4],[6,1,6,4],[7,1,7,4],[10,1,10,4],[8,2,8,4],[9,2,9,4],[11,1,11,4],[12,2,12,4],[13,2,13,4]]}
[]
[]
[]
[null,"المقدمة"]
[null,"ستكون قائمة التقييم الذاتي هذه مفيدة للغاية للمؤسسات الصغيرة والمتوسطة الحجم في جميع القطاعات. هذا التقييم الذاتي يعمل كأداة توجيهية تمكن المؤسسات من تحديد مجالات التركيز الرئيسية ضد مفاهيم حماية خصوصية البيانات التي يتم تناولها في قانون حماية خصوصية البيانات الشخصية (PDPPL)، وتوجهم لتطوير معارفهم نحو المبادئ التوجيهية الرئيسية ذات الصلة وتطور نضج برنامج خصوصية البيانات الخاص بهم لتعزيز سمعتهم وزيادة ثقة عملائهم بهم وتساعدهم بإدارة مخاطر حماية خصوصية البيانات."]
[null,"التعليمات"]
[null,"١ - لإجراء تقييم ذاتي لامتثال قانون حماية خصوصية البيانات الشخصية (PDPPL) لمؤسستكم، انقر فوق الزر \"بدء التقييم الذاتي\" أعلاه.\nيجب عليكم تحديد خيار واحد فقط لكل سؤال في العمود الأصفر ضمن التقييم الذاتي. إذا كنتم ترغبون في إعادة تشغيل التقييم الذاتي، فما عليكم سوى النقر فوق الزر \"إعادة تشغيل التقييم الذاتي\" الذي سيمسح إجاباتكم . قبل إجراء التقييم،يجب التأكد من مسح جميع الإجابات في العمود E، ثم متباعة الإجابة على الأسئلة عن طريق تحديد الإجابة الأكثر صلة بمؤسستكم.\n٢ - بمجرد اكتمال قائمة التحقق من التقييم الذاتي، انقر فوق الزر \"إعداد تقرير\" للحصول على ملخص عالي المستوى للاعتبارات الأولية التي يجب إجراؤها استنادًا إلى الإجابات المقدمة في قائمة المراجعة عند تخطيط الإجراءات لزيادة مستوى نضج مؤسستكم فيما يخص الامتثال لحماية خصوصية البيانات. يجب التنوية أن استكمال الاعتبارات الموصى بها في التقرير الذي تم إعداده لن يضمن الامتثال من جانب المؤسسة. المؤسسات مسؤولة عن امتثالها الخاص ويجب أن تشير إلى المبادئ التوجيهية المرجعية  لكل سؤال للحصول على معلومات حول كل موضوع إلى جانب قانون حماية خصوصية البيانات الشخصية (PDPPL)، وجميع المبادئ التوجيهية الصادرة عن شؤون الحوكمة والضمان السيبراني الوطني، وأي قرارات وزارية ذات صلة."]
[null,"المرجع للون العمود"]
[null,null,"تتكون عناوين الأعمدة المشار إليها بهذا اللون معنية للتعديل."]
[null,null,"عناوين الأعمدة المشار إليها بهذا اللون ليست معنية للتعديل."]
[null,"فهم نتائجكم"]
[null,"عند إكمال التقييم والنقر على \"إنتاج تقرير\"، سيتم تزويد التقرير بنظرة عامة على نتائجكم بناءً على إجاباتكم. سيتضمن أحد التصنيفات التالية:"]
[null,"أخضر","استنادًا إلى إجاباتك، لدى مؤسستك برنامج ناضج لحماية خصوصية البيانات على الرغم من أن بعض الإجراءات قد لا تزال مطلوبة لتحقيق مستوى نضج عالي للامتثال. \nيجب التنويه أنه لا يزال يتعين عليكم السعي إلى تنفيذ برنامج كامل للامتثال لقانون حماية خصوصية البيانات الشخصية (PDPPL)، لأن هذا التقييم ليس بديلاً لقراءة وفهم والعمل وفقًا للمبادئ التوجيهية و قانون حماية خصوصية البيانات الشخصية (PDPPL)، المبادئ التوجيهية الخاصة بإدارة الامتثال وحماية البيانات، وأي ثرارات وزارية ذات صلة."]
[null,"أصفر","استنادًا إلى إجاباتكم، أبدت مؤسستكم مبادرة في إنشاء برنامج خصوصية البيانات ولكن لا تزال تفتقر إلى بعض الأنشطة الأساسية التي ستكون مطلوبة لإثبات الامتثال."]
[null,"الأحمر","استنادًا إلى إجاباتكم، ليس لدى مؤسستكم حاليًا برنامج حماية خصوصية بيانات مناسب وستحتاج إلى تخطيط وإجراء الأنشطة الموصى بها لتجنب تعطل الأعمال و / أو الغرامات التنظيمية الهامة و / أو المطالبات أو الشكاوى / الطلبات القانونية من الأفراد ."]
{"$rows_left_out":3}
{"sheet":"٣ - التقييم الذاتي","index":2,"n_rows":64,"n_cols":9,"rows_kept":64,"cut":false,"hidden":false,"merged":[[31,4,33,4],[25,1,27,1],[28,1,30,1],[28,2,30,2],[28,3,30,3],[28,4,30,4],[31,1,33,1],[25,4,27,4],[25,2,27,2],[25,3,27,3],[31,2,33,2],[31,3,33,3],[34,4,36,4],[37,1,39,1],[37,2,39,2],[37,4,39,4],[43,1,45,1],[43,2,45,2],[43,3,45,3],[40,1,42,1],[40,2,42,2],[40,3,42,3],[40,4,42,4],[43,4,45,4],[19,4,21,4],[22,4,24,4],[7,1,9,1],[7,2,9,2],[7,3,9,3],[10,1,12,1],[10,2,12,2],[10,3,12,3],[7,4,9,4],[10,4,12,4],[13,4,15,4],[13,1,15,1],[16,1,18,1],[16,2,18,2],[16,3,18,3],[16,4,18,4],[3,5,3,8],[5,1,6,1],[5,2,6,2],[5,3,6,3],[5,4,6,4],[13,2,15,2],[13,3,15,3],[19,1,21,1],[19,2,21,2],[19,3,21,3],[22,1,24,1],[22,2,24,2],[22,3,24,3],[37,3,39,3],[34,1,36,1],[34,2,36,2],[34,3,36,3],[49,4,51,4],[49,1,51,1],[49,2,51,2],[49,3,51,3],[46,1,48,1],[46,2,48,2],[46,3,48,3],[46,4,48,4],[52,4,54,4],[61,1,63,1],[61,2,63,2],[61,3,63,3],[61,4,63,4],[55,1,57,1],[55,2,57,2],[55,3,57,3],[55,4,57,4],[58,1,60,1],[58,2,60,2],[58,3,60,3],[58,4,60,4],[52,1,54,1],[52,2,54,2],[52,3,54,3]]}
[false]
[]
[null,null,null,null,null,null,null,null,false]
[null,{"$f":"'٥ - قائمة الأجوبة'!B3","v":"المرجع"},{"$f":"'٥ - قائمة الأجوبة'!C3","v":"المبادئ التوجيهية الأساسابية لشؤون الحوكمة والضمان السيبراني الوطني"},{"$f":"'٥ - قائمة الأجوبة'!D3","v":"الفئة"},{"$f":"'٥ - قائمة الأجوبة'!E3","v":"السؤال"},"الإجابة"]
[null,null,null,null,null,null,"انقر على إجابة واحدة فقط لكل سؤال"]
[null,{"$f":"'٥ - قائمة الأجوبة'!B5","v":"1\n(المقدمة)"},{"$f":"'٥ - قائمة الأجوبة'!C5","v":"N/A"},{"$f":"'٥ - قائمة الأجوبة'!D5","v":"قابلية تطبيق قانون حماية خصوصية البيانات الشخصية (PDPPL)"},{"$f":"'٥ - قائمة الأجوبة'!E5","v":"هل تقوم مؤسستك بمعالجة البيانات الشخصية إلكترونيًا؛ جمع البيانات الشخصية أو تلقيها أو استخراجها تحسبًا لمعالجتها إلكترونيًا أو معالجة البيانات الشخصية من خلال مجموعة من تقنيات المعالجة الإلكترونية والتقليدية؟\n\n* إذا لم تقم بمعالجة أي بيانات شخصية، فلن تحتاج إلى إكمال باقي هذا التقييم أو اتخاذ إجراء للامتثال لـقانون حماية خصوصية البيانات الشخصية (PDPPL)."},{"$f":"'٥ - قائمة الأجوبة'!H5","v":"أ"},false,{"$f":"F6","v":"أ"},{"$f":"'٥ - قائمة الأجوبة'!I5","v":"لا"}]
[null,null,null,null,null,{"$f":"'٥ - قائمة الأجوبة'!H6","v":"ب"},false,{"$f":"F7","v":"ب"},{"$f":"'٥ - قائمة الأجوبة'!I6","v":"نعم"}]
[null,{"$f":"'٥ - قائمة الأجوبة'!B7","v":2},{"$f":"'٥ - قائمة الأجوبة'!C7","v":"- Principles of Data Privacy Guidelines for Regulated Entities"},{"$f":"'٥ - قائمة الأجوبة'!D7","v":"المبادئ الأساسبة لحماية خصوصية البيانات"},{"$f":"'٥ - قائمة الأجوبة'!E7","v":"هل تقوم مؤسستك بإجراء مراجعات منتظمة لفهم معالجة البيانات الشخصية التي تقوم بها؟\n\n* ستساعدكم عمليات التدقيق هذه على فهم كيفية تدفق البيانات الشخصية عبر المؤسسة وكيفية استخدامها."},{"$f":"'٥ - قائمة الأجوبة'!H7","v":"أ"},false,{"$f":"F8","v":"أ"},{"$f":"'٥ - قائمة الأجوبة'!I7","v":"لا - لم يكتمل بعد"}]
[null,null,null,null,null,{"$f":"'٥ - قائمة الأجوبة'!H8","v":"ب"},false,{"$f":"F9","v":"ب"},{"$f":"'٥ - قائمة الأجوبة'!I8","v":"نعم - تم بنجاح"}]
[null,null,null,null,null,{"$f":"'٥ - قائمة الأجوبة'!H9","v":"ج"},false,{"$f":"F10","v":"ج"},{"$f":"'٥ - قائمة الأجوبة'!I9","v":"لا - لا ينطبق"}]
[null,{"$f":"'٥ - قائمة الأجوبة'!B10","v":3},{"$f":"'٥ - قائمة الأجوبة'!C10","v":"- Register of Processing Activities (RoPA) Guidelines for Regulated Entities"},{"$f":"'٥ - قائمة الأجوبة'!D10","v":"المبادئ الأساسبة لحماية خصوصية البيانات"},{"$f":"'٥ - قائمة الأجوبة'!E10","v":"هل تقوم مؤسستكم بتوثيق البيانات الشخصية للأفراد (مثل العملاء و / أو الموظفين) التي تعالجها في سجلات أنشطة معالجة البيانات الشخصية (RoPA)؟"},{"$f":"'٥ - قائمة الأجوبة'!H10","v":"أ"},false,{"$f":"F11","v":"أ"},{"$f":"'٥ - قائمة الأجوبة'!I10","v":"لا - لم يكتمل بعد"}]
[null,null,null,null,null,{"$f":"'٥ - قائمة الأجوبة'!H11","v":"ب"},false,"ب",{"$f":"'٥ - قائمة الأجوبة'!I11","v":"نعم - تم بنجاح"}]
[null,null,null,null,null,{"$f":"'٥ - قائمة الأجوبة'!H12","v":"ج"},false,"ج",{"$f":"'٥ - قائمة الأجوبة'!I12","v":"لا - لا ينطبق"}]
[null,{"$f":"'٥ - قائمة الأجوبة'!B13","v":4},{"$f":"'٥ - قائمة الأجوبة'!C13","v":"- Permitted Reasons Guidelines for Regulated Entities"},{"$f":"'٥ - قائمة الأجوبة'!D13","v":"الأسباب التي تسمح بمعالجة البيانات الشخصية"},{"$f":"'٥ - قائمة الأجوبة'!E13","v":"هل لدى مؤسستك إجراءات لتحديد وتوثيق السبب الذي يسمح بمعالجة البيانات الشخصية؟\n\n* بموجب قانون حماية خصوصية البيانات الشخصية (PDPPL)، هناك أربعة أسبابتسمح بمعالحة البيانات الشخصية، وهي:\n- موافقة صريحة: من الفرد لمعالجة البيانات الشخصية.\n- التزام تعاقدي: هناك حاجة للمعالجة من أجل إبرام أو تنفيذ العقد.\n- الالتزام القانوني: الذي تلتزم المؤسسة بموجبه بمعالجة البيانات الخاصة به.\n- المصلحة المشروعة: للمؤسسة أو الأطراف الثالثة المشاركة."},{"$f":"'٥ - قائمة الأجوبة'!H13","v":"أ"},false,"أ",{"$f":"'٥ - قائمة الأجوبة'!I13","v":"لا - لم يكتمل بعد"}]
[null,null,null,null,null,{"$f":"'٥ - قائمة الأجوبة'!H14","v":"ب"},false,"ب",{"$f":"'٥ - قائمة الأجوبة'!I14","v":"نعم - تم بنجاح"}]
{"$rows_left_out":50}
{"sheet":"٤ - التقرير","index":3,"n_rows":30,"n_cols":11,"rows_kept":30,"cut":false,"hidden":false,"merged":[[20,7,20,8],[21,7,21,8],[22,7,22,8],[23,7,23,8],[24,7,24,8],[18,7,18,8],[19,7,19,8],[1,6,1,10],[3,10,5,10],[8,6,8,8],[9,6,9,8],[10,7,10,8],[11,7,11,8],[12,7,12,8],[13,7,13,8],[14,7,14,8],[15,7,15,8],[16,7,16,8],[17,7,17,8],[25,7,25,8],[26,7,26,8],[27,7,27,8],[28,7,28,8],[29,7,29,8]]}
[]
[null,null,null,null,null,null,"Report Dashboard"]
[null,null,null,null,null,null,"المرجع","الجواب","رقم الأجوبة",null,"التقييم العام"]
[null,null,null,null,null,null,"أ","لا - لم يكتمل بعد",{"$f":"COUNTIF($G$11:$G$30,\"أ\")","v":0},{"$f":"I4/K7","v":0},{"$f":"_xlfn.IFS(J5>0.67,\"أخضر\", 0.33>J5, \"أحمر\", 0.67>J5,\"أصفر\")","v":"أحمر"}]
[null,null,null,null,null,null,"ب","نعم - تم بنجاح",{"$f":"COUNTIF($G$11:$G$30,\"ب\")","v":0},{"$f":"I5/K7","v":0}]
[null,null,null,null,null,null,"ج","لا - لا ينطبق",{"$f":"COUNTIF($G$11:$G$30,\"ج\")","v":0}]
[null,null,null,null,null,null,null,null,null,{"$f":"SUM(J4:J5)","v":0},{"$f":"20-I6","v":20}]
[]
[null,{"$f":"'٥ - قائمة الأجوبة'!B3","v":"المرجع"},{"$f":"'٥ - قائمة الأجوبة'!C3","v":"المبادئ التوجيهية الأساسابية لشؤون الحوكمة والضمان السيبراني الوطني"},{"$f":"'٥ - قائمة الأجوبة'!D3","v":"الفئة"},{"$f":"'٥ - قائمة الأجوبة'!E3","v":"السؤال"},"CONCAT","الإجابة",null,null,null,{"$f":"'٥ - قائمة الأجوبة'!J3","v":"الاعتبارات الأولية"}]
[]
[null,{"$f":"'٣ - التقييم الذاتي'!B6","v":"1\n(المقدمة)"},{"$f":"'٣ - التقييم الذاتي'!C6","v":"N/A"},{"$f":"'٣ - التقييم الذاتي'!D6","v":"قابلية تطبيق قانون حماية خصوصية البيانات الشخصية (PDPPL)"},{"$f":"'٣ - التقييم الذاتي'!E6","v":"هل تقوم مؤسستك بمعالجة البيانات الشخصية إلكترونيًا؛ جمع البيانات الشخصية أو تلقيها أو استخراجها تحسبًا لمعالجتها إلكترونيًا أو معالجة البيانات الشخصية من خلال مجموعة من تقنيات المعالجة الإلكترونية والتقليدية؟\n\n* إذا لم تقم بمعالجة أي بيانات شخصية، فلن تحتاج إلى إكمال باقي هذا التقييم أو اتخاذ إجراء للامتثال لـقانون حماية خصوصية البيانات الشخصية (PDPPL)."},{"$f":"CONCATENATE(B11,G11)","v":{"$error":"#N/A"}},{"$f":"VLOOKUP(TRUE,'٣ - التقييم الذاتي'!G6:H7,2,FALSE)","v":{"$error":"#N/A"}},{"$f":"VLOOKUP(G11,$G$4:$H$6,2,FALSE)","v":{"$error":"#N/A"}},null,null,{"$f":"VLOOKUP(F11,'٥ - قائمة الأجوبة'!G5:J6,4,TRUE)","v":{"$error":"#N/A"}}]
[null,2,{"$f":"'٣ - التقييم الذاتي'!C8","v":"- Principles of Data Privacy Guidelines for Regulated Entities"},{"$f":"'٣ - التقييم الذاتي'!D8","v":"المبادئ الأساسبة لحماية خصوصية البيانات"},{"$f":"'٣ - التقييم الذاتي'!E8","v":"هل تقوم مؤسستك بإجراء مراجعات منتظمة لفهم معالجة البيانات الشخصية التي تقوم بها؟\n\n* ستساعدكم عمليات التدقيق هذه على فهم كيفية تدفق البيانات الشخصية عبر المؤسسة وكيفية استخدامها."},{"$error":"#N/A"},{"$f":"VLOOKUP(TRUE,'٣ - التقييم الذاتي'!G8:H10,2,FALSE)","v":{"$error":"#N/A"}},{"$error":"#N/A"},null,null,{"$f":"VLOOKUP(F12,'٥ - قائمة الأجوبة'!G7:J9,4,TRUE)","v":{"$error":"#N/A"}}]
[null,{"$f":"'٣ - التقييم الذاتي'!B11","v":3},{"$f":"'٣ - التقييم الذاتي'!C11","v":"- Register of Processing Activities (RoPA) Guidelines for Regulated Entities"},{"$f":"'٣ - التقييم الذاتي'!D11","v":"المبادئ الأساسبة لحماية خصوصية البيانات"},{"$f":"'٣ - التقييم الذاتي'!E11","v":"هل تقوم مؤسستكم بتوثيق البيانات الشخصية للأفراد (مثل العملاء و / أو الموظفين) التي تعالجها في سجلات أنشطة معالجة البيانات الشخصية (RoPA)؟"},{"$error":"#N/A"},{"$f":"VLOOKUP(TRUE,'٣ - التقييم الذاتي'!G11:H13,2,FALSE)","v":{"$error":"#N/A"}},{"$error":"#N/A"},null,null,{"$f":"VLOOKUP(F13,'٥ - قائمة الأجوبة'!G10:J12,4,TRUE)","v":{"$error":"#N/A"}}]
[null,{"$f":"'٣ - التقييم الذاتي'!B14","v":4},{"$f":"'٣ - التقييم الذاتي'!C14","v":"- Permitted Reasons Guidelines for Regulated Entities"},{"$f":"'٣ - التقييم الذاتي'!D14","v":"الأسباب التي تسمح بمعالجة البيانات الشخصية"},{"$f":"'٣ - التقييم الذاتي'!E14","v":"هل لدى مؤسستك إجراءات لتحديد وتوثيق السبب الذي يسمح بمعالجة البيانات الشخصية؟\n\n* بموجب قانون حماية خصوصية البيانات الشخصية (PDPPL)، هناك أربعة أسبابتسمح بمعالحة البيانات الشخصية، وهي:\n- موافقة صريحة: من الفرد لمعالجة البيانات الشخصية.\n- التزام تعاقدي: هناك حاجة للمعالجة من أجل إبرام أو تنفيذ العقد.\n- الالتزام القانوني: الذي تلتزم المؤسسة بموجبه بمعالجة البيانات الخاصة به.\n- المصلحة المشروعة: للمؤسسة أو الأطراف الثالثة المشاركة."},{"$error":"#N/A"},{"$f":"VLOOKUP(TRUE,'٣ - التقييم الذاتي'!G14:H16,2,FALSE)","v":{"$error":"#N/A"}},{"$error":"#N/A"},null,null,{"$f":"VLOOKUP(F14,'٥ - قائمة الأجوبة'!G13:J15,4,TRUE)","v":{"$error":"#N/A"}}]
[null,{"$f":"'٣ - التقييم الذاتي'!B17","v":5},{"$f":"'٣ - التقييم الذاتي'!C17","v":"- Competent Authority Exemptions Guidelines for Regulated Entities\n\n- Controller Exemptions Guidelines for Regulated Entities"},{"$f":"'٣ - التقييم الذاتي'!D17","v":"الاعفاءات"},{"$f":"'٣ - التقييم الذاتي'!E17","v":"هل لدى مؤسستكم إجراءات معمول بها لتحديد وتوثيق أي استثناءات بموجب المادتين ١٨ و / أو  ١٩؟"},{"$error":"#N/A"},{"$f":"VLOOKUP(TRUE,'٣ - التقييم الذاتي'!G17:H19,2,FALSE)","v":{"$error":"#N/A"}},{"$error":"#N/A"},null,null,{"$f":"VLOOKUP(F15,'٥ - قائمة الأجوبة'!G16:J18,4,TRUE)","v":{"$error":"#N/A"}}]
{"$rows_left_out":16}
{"sheet":"٥ - قائمة الأجوبة","index":4,"n_rows":63,"n_cols":10,"rows_kept":63,"cut":false,"hidden":false,"merged":[[9,2,11,2],[15,2,17,2],[12,2,14,2],[6,2,8,2],[4,2,5,2],[36,4,38,4],[30,1,32,1],[33,1,35,1],[33,3,35,3],[33,4,35,4],[36,1,38,1],[30,4,32,4],[30,3,32,3],[36,3,38,3],[33,2,35,2],[30,2,32,2],[36,2,38,2],[39,4,41,4],[42,1,44,1],[42,3,44,3],[42,4,44,4],[39,2,41,2],[42,2,44,2],[45,4,47,4],[51,1,53,1],[51,3,53,3],[48,4,50,4],[51,4,53,4],[48,1,50,1],[48,3,50,3],[45,2,47,2],[51,2,53,2],[48,2,50,2],[2,7,2,8],[6,1,8,1],[6,3,8,3],[6,4,8,4],[4,1,5,1],[4,3,5,3],[4,4,5,4],[3,7,3,8],[24,4,26,4],[27,4,29,4],[9,1,11,1],[9,3,11,3],[15,1,17,1],[15,3,17,3],[12,1,14,1],[12,3,14,3],[9,4,11,4],[15,4,17,4],[18,4,20,4],[12,4,14,4],[18,1,20,1],[21,1,23,1],[21,3,23,3],[21,4,23,4],[18,3,20,3],[21,2,23,2],[18,2,20,2],[24,1,26,1],[24,3,26,3],[27,1,29,1],[27,3,29,3],[24,2,26,2],[27,2,29,2],[60,1,62,1],[60,3,62,3],[45,1,47,1],[45,3,47,3],[39,1,41,1],[39,3,41,3],[60,4,62,4],[54,1,56,1],[54,3,56,3],[54,4,56,4],[57,1,59,1],[57,3,59,3],[57,4,59,4],[60,2,62,2],[54,2,56,2],[57,2,59,2]]}
[]
[]
[null,"المرجع","المبادئ التوجيهية الأساسابية لشؤون الحوكمة والضمان السيبراني الوطني","الفئة","السؤال","Hidden Ref.","CONCAT","الإجابة",null,"الاعتبارات الأولية"]
[]
[null,"1\n(المقدمة)","N/A","قابلية تطبيق قانون حماية خصوصية البيانات الشخصية (PDPPL)","هل تقوم مؤسستك بمعالجة البيانات الشخصية إلكترونيًا؛ جمع البيانات الشخصية أو تلقيها أو استخراجها تحسبًا لمعالجتها إلكترونيًا أو معالجة البيانات الشخصية من خلال مجموعة من تقنيات المعالجة الإلكترونية والتقليدية؟\n\n* إذا لم تقم بمعالجة أي بيانات شخصية، فلن تحتاج إلى إكمال باقي هذا التقييم أو اتخاذ إجراء للامتثال لـقانون حماية خصوصية البيانات الشخصية (PDPPL).",{"$f":"B5","v":"1\n(المقدمة)"},{"$f":"CONCATENATE(F5,H5)","v":"1\n(المقدمة)أ"},"أ","لا","o لا يتم تسجيل معالجة المؤسسة للبيانات في نطاق قانون حماية خصوصية البيانات الشخصية (PDPPL) ولا تحتاج إلى اتخاذ إجراءات للامتثال."]
[null,null,null,null,null,{"$f":"B5","v":"1\n(المقدمة)"},"1\n(المقدمة)ب","ب","نعم","o يتم تسجيل معالجة المؤسسة للبيانات في نطاق قانون حماية خصوصية البيانات الشخصية (PDPPL) ويجب أن تتخذ إجراءات للامتثال."]
[null,2,"- Principles of Data Privacy Guidelines for Regulated Entities","المبادئ الأساسبة لحماية خصوصية البيانات","هل تقوم مؤسستك بإجراء مراجعات منتظمة لفهم معالجة البيانات الشخصية التي تقوم بها؟\n\n* ستساعدكم عمليات التدقيق هذه على فهم كيفية تدفق البيانات الشخصية عبر المؤسسة وكيفية استخدامها.",{"$f":"B7","v":2},{"$f":"CONCATENATE(F7,H7)","v":"2أ"},"أ","لا - لم يكتمل بعد","o القيام بالتخطيط لجدول تدقيق عبر مؤسستكم لتوثيق وفهم كيفية تدفق المعلومات الشخصية عبر المؤسسة.\no توثيق وتخطيط معالجة أي مخاطر تم تحديدها كجزء من المراجعة."]
[null,null,null,null,null,{"$f":"B7","v":2},"2ب","ب","نعم - تم بنجاح","o توثيق وتخطيط معالجة أي مخاطر تم تحديدها كجزء من المراجعة.\no التأكد من إجراء ذلك من قبل شخص لديه معرفة واسعة بالمؤسسة."]
[null,null,null,null,null,{"$f":"B7","v":2},"2ج","ج","لا - لا ينطبق","o توثيق الاستدلال لسبب عدم الانطباق. إذا لم تكن متأكدًا من إمكانية التطبيق، فيرجى زيارة الموقع الإلكتروني لشؤون الحوكمة والضمان السيبراني الوطني ومراجعة المبادئ التوجيهية المنشورة ذات الصلة."]
[null,3,"- Register of Processing Activities (RoPA) Guidelines for Regulated Entities","المبادئ الأساسبة لحماية خصوصية البيانات","هل تقوم مؤسستكم بتوثيق البيانات الشخصية للأفراد (مثل العملاء و / أو الموظفين) التي تعالجها في سجلات أنشطة معالجة البيانات الشخصية (RoPA)؟",{"$f":"B10","v":3},"3أ","أ","لا - لم يكتمل بعد","o إنشاء سجل أنشطة معالجة البيانات الشخصية (RoPA) الذي يحتفظ بسجلات أنشطة المعالجة وفقا للمبادئ التوجيهية المنشورة من قبل شؤون الحوكمة والضمان السيبراني الوطني."]
[null,null,null,null,null,{"$f":"B10","v":3},"3ب","ب","نعم - تم بنجاح","o القيام بمراجعة سجل أنشطة معالجة البيانات الشخصية (RoPA) وفقًا للمبادئ التوجيهية المنشورة من قبل شؤون الحوكمة والضمان السيبراني الوطني للتأكد من أن سجل أنشطة معالجة البيانات الشخصية (RoPA) الحالي يقوم بجمع جميع المعلومات المطلوبة.\no القيام بمراقبة سجل أنشطة معالجة البيانات الشخصية (RoPA) للتأكد من أن المعلومات الموثقة في السجل ذات صلة ومحدثة وتبقى قيد المراجعة."]
[null,null,null,null,null,{"$f":"B10","v":3},"3ج","ج","لا - لا ينطبق","o توثيق الاستدلال لسبب عدم الانطباق. إذا لم تكن متأكدًا من إمكانية التطبيق ، فيرجى زيارة الموقع الإلكتروني لشؤون الحوكمة والضمان السيبراني الوطني ومراجعة المبادئ التوجيهية المنشورة ذات الصلة."]
[null,4,"- Permitted Reasons Guidelines for Regulated Entities","الأسباب التي تسمح بمعالجة البيانات الشخصية","هل لدى مؤسستك إجراءات لتحديد وتوثيق السبب الذي يسمح بمعالجة البيانات الشخصية؟\n\n* بموجب قانون حماية خصوصية البيانات الشخصية (PDPPL)، هناك أربعة أسبابتسمح بمعالحة البيانات الشخصية، وهي:\n- موافقة صريحة: من الفرد لمعالجة البيانات الشخصية.\n- التزام تعاقدي: هناك حاجة للمعالجة من أجل إبرام أو تنفيذ العقد.\n- الالتزام القانوني: الذي تلتزم المؤسسة بموجبه بمعالجة البيانات الخاصة به.\n- المصلحة المشروعة: للمؤسسة أو الأطراف الثالثة المشاركة.",{"$f":"B13","v":4},{"$f":"CONCATENATE(F13,H13)","v":"4أ"},"أ",{"$f":"I10","v":"لا - لم يكتمل بعد"},"o  القيام بوضع إجراءات لتحديد وتوثيق الأسباب التي تسمح بمعالجة البيانات الشخصية قبل معالجة البيانات الشخصية عبر المؤسسة."]
[null,null,null,null,null,{"$f":"B13","v":4},"4ب","ب","نعم - تم بنجاح","o التأكد من أن الأسباب التي تسمح بمعالجة البيانات الشخصية الموثقة للمعالجة المحددة دقيقة. \nملحوظة لا يوجد سبب واحد أفضل أو أكثر أهمية من الآخرين. اعتمادًا على الغرض من المعالجة والعلاقة مع الفرد ، ستتمكن من تحديد أنسب سبب يسمح بمعالجة البيانات الشخصية."]
[null,null,null,null,null,{"$f":"B13","v":4},"4ج","ج","لا - لا ينطبق","توثيق الإعفاءات من تحديد السبب الذي يسمح بمعالجة البيانات الشخصية حيث يقتضي الأمر وفقًا المبادئ التوجيهية ذات الصلة المنشورة في قبل شؤون الحوكمة والضمان السيبراني الوطني.\nملحوظة تتوفر الإعفاءات من المادة ٤ للمراقبين بموجب المادة ١٨ في ظروف معينة."]
{"$rows_left_out":48}